Reaction Details
TargetBromodomain-containing protein 4
LigandBDBM50150755
Substrate/Competitorn/a
Meas. Tech.ChEBML_1561953
IC50 13000±n/a nM
Citation Raux, BVoitovich, YDerviaux, CLugari, ARebuffet, EMilhas, SPriet, SRoux, TTrinquet, EGuillemot, JCKnapp, SBrunel, JMFedorov, AYCollette, YRoche, PBetzi, SCombes, SMorelli, X Exploring Selective Inhibition of the First Bromodomain of the Human Bromodomain and Extra-terminal Domain (BET) Proteins. J Med Chem59:1634-41 (2016) 
 
Bromodomain-containing protein 4
Name:Bromodomain-containing protein 4
Type:Protein
Mol. Mass.:152264.84
Organism:Homo sapiens (Human)
Description:O60885
Residue:1362
BDBM50150755
NameBDBM50150755
Synonyms:CHEMBL3775270
TypeSmall organic molecule
Emp. Form.C11H16N4O2
Mol. Mass.236.2703
SMILESCCCCn1c2ncn(CC)c2c(=O)[nH]c1=O