Reaction Details
TargetBromodomain-containing protein 4
LigandBDBM50150752
Substrate/Competitorn/a
Meas. Tech.ChEBML_1561953
IC50 26400±n/a nM
Citation Raux, BVoitovich, YDerviaux, CLugari, ARebuffet, EMilhas, SPriet, SRoux, TTrinquet, EGuillemot, JCKnapp, SBrunel, JMFedorov, AYCollette, YRoche, PBetzi, SCombes, SMorelli, X Exploring Selective Inhibition of the First Bromodomain of the Human Bromodomain and Extra-terminal Domain (BET) Proteins. J Med Chem59:1634-41 (2016) 
 
Bromodomain-containing protein 4
Name:Bromodomain-containing protein 4
Type:Protein
Mol. Mass.:152264.84
Organism:Homo sapiens (Human)
Description:O60885
Residue:1362
BDBM50150752
NameBDBM50150752
Synonyms:CHEMBL3774900
TypeSmall organic molecule
Emp. Form.C17H17ClN8O2S
Mol. Mass.432.887
SMILESCCn1c(CSc2n[nH]c(N)n2)nc2n(Cc3ccc(Cl)cc3)c(=O)[nH]c(=O)c12