Reaction Details
TargetBromodomain-containing protein 2
LigandBDBM50150755
Substrate/Competitorn/a
Meas. Tech.ChEBML_1561955
IC50 18800±n/a nM
Citation Raux, BVoitovich, YDerviaux, CLugari, ARebuffet, EMilhas, SPriet, SRoux, TTrinquet, EGuillemot, JCKnapp, SBrunel, JMFedorov, AYCollette, YRoche, PBetzi, SCombes, SMorelli, X Exploring Selective Inhibition of the First Bromodomain of the Human Bromodomain and Extra-terminal Domain (BET) Proteins. J Med Chem59:1634-41 (2016) 
 
Bromodomain-containing protein 2
Name:Bromodomain-containing protein 2
Type:Protein
Mol. Mass.:88085.95
Organism:Homo sapiens (Human)
Description:P25440
Residue:801
BDBM50150755
NameBDBM50150755
Synonyms:CHEMBL3775270
TypeSmall organic molecule
Emp. Form.C11H16N4O2
Mol. Mass.236.2703
SMILESCCCCn1c2ncn(CC)c2c(=O)[nH]c1=O