Reaction Details
TargetcAMP-specific 3',5'-cyclic phosphodiesterase 4A
LigandBDBM50150241
Substrate/Competitorn/a
Meas. Tech.ChEMBL_1556442 (CHEMBL3772473)
Ki 65±n/a nM
Citation Li, PZheng, HZhao, JZhang, LYao, WZhu, HBeard, JDIda, KLane, WSnell, GSogabe, SHeyser, CJSnyder, GLHendrick, JPVanover, KEDavis, REWennogle, LP Discovery of Potent and Selective Inhibitors of Phosphodiesterase 1 for the Treatment of Cognitive Impairment Associated with Neurodegenerative and Neuropsychiatric Diseases. J Med Chem59:1149-64 (2016) 
 
cAMP-specific 3',5'-cyclic phosphodiesterase 4A
Name:cAMP-specific 3',5'-cyclic phosphodiesterase 4A
Type:Enzyme
Mol. Mass.:98113.27
Organism:Homo sapiens (Human)
Description:P27815
Residue:886
BDBM50150241
NameBDBM50150241
Synonyms:CHEMBL3770585
TypeSmall organic molecule
Emp. Form.C25H26N6O3S
Mol. Mass.490.577
SMILES[H][C@@]12CCC[C@]1([H])N1C(=N2)N(C)C(=O)c2c1nn(Cc1ccc(cc1)S(C)(=O)=O)c2Nc1ccccc1