Reaction Details
TargetcAMP-specific 3',5'-cyclic phosphodiesterase 4A
LigandBDBM50150276
Substrate/Competitorn/a
Meas. Tech.ChEMBL_1556442 (CHEMBL3772473)
Ki 4000±n/a nM
Citation Li, PZheng, HZhao, JZhang, LYao, WZhu, HBeard, JDIda, KLane, WSnell, GSogabe, SHeyser, CJSnyder, GLHendrick, JPVanover, KEDavis, REWennogle, LP Discovery of Potent and Selective Inhibitors of Phosphodiesterase 1 for the Treatment of Cognitive Impairment Associated with Neurodegenerative and Neuropsychiatric Diseases. J Med Chem59:1149-64 (2016) 
 
cAMP-specific 3',5'-cyclic phosphodiesterase 4A
Name:cAMP-specific 3',5'-cyclic phosphodiesterase 4A
Type:Enzyme
Mol. Mass.:98113.27
Organism:Homo sapiens (Human)
Description:P27815
Residue:886
BDBM50150276
NameBDBM50150276
Synonyms:CHEMBL3770645
TypeSmall organic molecule
Emp. Form.C30H28FN7O
Mol. Mass.521.588
SMILES[H][C@@]12CCC[C@]1([H])N1C(=N2)N(C)C(=O)c2c(NCc3ccccc3)n(Cc3ccc(cc3)-c3cccc(F)n3)nc12