Reaction Details
TargetcAMP-specific 3',5'-cyclic phosphodiesterase 4A
LigandBDBM50150285
Substrate/Competitorn/a
Meas. Tech.ChEMBL_1556442 (CHEMBL3772473)
Ki 330±n/a nM
Citation Li, PZheng, HZhao, JZhang, LYao, WZhu, HBeard, JDIda, KLane, WSnell, GSogabe, SHeyser, CJSnyder, GLHendrick, JPVanover, KEDavis, REWennogle, LP Discovery of Potent and Selective Inhibitors of Phosphodiesterase 1 for the Treatment of Cognitive Impairment Associated with Neurodegenerative and Neuropsychiatric Diseases. J Med Chem59:1149-64 (2016) 
 
cAMP-specific 3',5'-cyclic phosphodiesterase 4A
Name:cAMP-specific 3',5'-cyclic phosphodiesterase 4A
Type:Enzyme
Mol. Mass.:98113.27
Organism:Homo sapiens (Human)
Description:P27815
Residue:886
BDBM50150285
NameBDBM50150285
Synonyms:CHEMBL3769961
TypeSmall organic molecule
Emp. Form.C29H26FN7O
Mol. Mass.507.5614
SMILES[H][C@@]12CCC[C@]1([H])N1C(=N2)N(C)C(=O)c2c(Nc3ccccc3)n(Cc3ccc(cc3)-c3cc(F)ccn3)nc12