Reaction Details
TargetcGMP-inhibited 3',5'-cyclic phosphodiesterase 3B
LigandBDBM50150239
Substrate/Competitorn/a
Meas. Tech.ChEMBL_1556446 (CHEMBL3772477)
Ki 30000±n/a nM
Citation Li, PZheng, HZhao, JZhang, LYao, WZhu, HBeard, JDIda, KLane, WSnell, GSogabe, SHeyser, CJSnyder, GLHendrick, JPVanover, KEDavis, REWennogle, LP Discovery of Potent and Selective Inhibitors of Phosphodiesterase 1 for the Treatment of Cognitive Impairment Associated with Neurodegenerative and Neuropsychiatric Diseases. J Med Chem59:1149-64 (2016) 
 
cGMP-inhibited 3',5'-cyclic phosphodiesterase 3B
Name:cGMP-inhibited 3',5'-cyclic phosphodiesterase 3B
Type:Enzyme
Mol. Mass.:124318.95
Organism:Homo sapiens (Human)
Description:PDE3B was generated from the full-length recombinant human clone transfected into Sf9 cells.
Residue:1112
BDBM50150239
NameBDBM50150239
Synonyms:CHEMBL3769461
TypeSmall organic molecule
Emp. Form.C25H23F3N6O
Mol. Mass.480.4849
SMILES[H][C@@]12CCC[C@]1([H])N1C(=N2)N(C)C(=O)c2c(Nc3ccccc3)n(Cc3ccc(cc3)C(F)(F)F)nc12