Reaction Details
TargetHigh affinity cAMP-specific and IBMX-insensitive 3',5'-cyclic phosphodiesterase 8A
LigandBDBM50150171
Substrate/Competitorn/a
Meas. Tech.ChEMBL_1556450 (CHEMBL3772481)
Ki 33000±n/a nM
Citation Li, PZheng, HZhao, JZhang, LYao, WZhu, HBeard, JDIda, KLane, WSnell, GSogabe, SHeyser, CJSnyder, GLHendrick, JPVanover, KEDavis, REWennogle, LP Discovery of Potent and Selective Inhibitors of Phosphodiesterase 1 for the Treatment of Cognitive Impairment Associated with Neurodegenerative and Neuropsychiatric Diseases. J Med Chem59:1149-64 (2016) 
 
High affinity cAMP-specific and IBMX-insensitive 3',5'-cyclic phosphodiesterase 8A
Name:High affinity cAMP-specific and IBMX-insensitive 3',5'-cyclic phosphodiesterase 8A
Type:Enzyme Catalytic Domain
Mol. Mass.:93295.89
Organism:Homo sapiens (Human)
Description:Recombinant catalytic domain (M1-E829) of human PDE8A.
Residue:829
BDBM50150171
NameBDBM50150171
Synonyms:CHEMBL3770470
TypeSmall organic molecule
Emp. Form.C30H28N6O
Mol. Mass.488.5829
SMILES[H][C@@]12CCC[C@]1([H])N1C(=N2)N(C)C(=O)c2c1nn(Cc1ccc(cc1)-c1ccccc1)c2Nc1ccccc1