Reaction Details
TargetHigh affinity cGMP-specific 3',5'-cyclic phosphodiesterase 9A
LigandBDBM50150239
Substrate/Competitorn/a
Meas. Tech.ChEMBL_1556451 (CHEMBL3772482)
Ki 50000±n/a nM
Citation Li, PZheng, HZhao, JZhang, LYao, WZhu, HBeard, JDIda, KLane, WSnell, GSogabe, SHeyser, CJSnyder, GLHendrick, JPVanover, KEDavis, REWennogle, LP Discovery of Potent and Selective Inhibitors of Phosphodiesterase 1 for the Treatment of Cognitive Impairment Associated with Neurodegenerative and Neuropsychiatric Diseases. J Med Chem59:1149-64 (2016) 
 
High affinity cGMP-specific 3',5'-cyclic phosphodiesterase 9A
Name:High affinity cGMP-specific 3',5'-cyclic phosphodiesterase 9A
Type:Protein
Mol. Mass.:68488.40
Organism:Homo sapiens (Human)
Description:O76083
Residue:593
BDBM50150239
NameBDBM50150239
Synonyms:CHEMBL3769461
TypeSmall organic molecule
Emp. Form.C25H23F3N6O
Mol. Mass.480.4849
SMILES[H][C@@]12CCC[C@]1([H])N1C(=N2)N(C)C(=O)c2c(Nc3ccccc3)n(Cc3ccc(cc3)C(F)(F)F)nc12