Reaction Details
TargetAlpha-galactosidase A
LigandBDBM50150472
Substrate/Competitorn/a
Meas. Tech.ChEMBL_1558581 (CHEMBL3774070)
Ki>2000000±n/a nM
Citation Thonhofer, MWeber, PSantana, AGFischer, RPabst, BMPaschke, ESchalli, MStütz, AETschernutter, MWindischhofer, WWithers, SG Synthesis of C-5a-chain extended derivatives of 4-epi-isofagomine: Powerfulß-galactosidase inhibitors and low concentration activators of GM1-gangliosidosis-related human lysosomalß-galactosidase. Bioorg Med Chem Lett26:1438-42 (2016) 
 
Alpha-galactosidase A
Name:Alpha-galactosidase A
Type:Protein
Mol. Mass.:48760.21
Organism:Homo sapiens (Human)
Description:n/a
Residue:429
BDBM50150472
NameBDBM50150472
Synonyms:CHEMBL3770736
TypeSmall organic molecule
Emp. Form.C10H22N2O3
Mol. Mass.218.2933
SMILESNCCCC[C@H]1NC[C@@H](O)[C@@H](O)[C@H]1CO