Reaction Details
TargetTransient receptor potential cation channel subfamily V member 1
LigandBDBM20488
Substrate/Competitorn/a
Meas. Tech.ChEMBL_1558647 (CHEMBL3771524)
IC50 270±n/a nM
Citation Morera, EDi Marzo, VMonti, LAllarà, MSchiano Moriello, ANalli, MOrtar, GDe Petrocellis, L Arylboronic acids as dual-action FAAH and TRPV1 ligands. Bioorg Med Chem Lett26:1401-5 (2016) 
 
Transient receptor potential cation channel subfamily V member 1
Name:Transient receptor potential cation channel subfamily V member 1
Type:Protein
Mol. Mass.:94960.75
Organism:Homo sapiens (Human)
Description:Q8NER1
Residue:839
BDBM20488
NameBDBM20488
Synonyms:(2E)-3-(4-chlorophenyl)-N-(3-methoxyphenyl)prop-2-enamide | SB-366791
TypeSmall organic molecule
Emp. Form.C16H14ClNO2
Mol. Mass.287.741
SMILESCOc1cccc(NC(=O)\C=C\c2ccc(Cl)cc2)c1