Reaction Details
TargetLysine-specific demethylase 4B
LigandBDBM50153153
Substrate/Competitorn/a
Meas. Tech.ChEMBL_1561970 (CHEMBL3778806)
IC50 3100±n/a nM
Citation Bavetsias, VLanigan, RMRuda, GFAtrash, BMcLaughlin, MGTumber, AMok, NYLe Bihan, YVDempster, SBoxall, KJJeganathan, FHatch, SBSavitsky, PVelupillai, SKrojer, TEngland, KSSejberg, JThai, CDonovan, APal, AScozzafava, GBennett, JMKawamura, AJohansson, CSzykowska, AGileadi, CBurgess-Brown, NAvon Delft, FOppermann, UWalters, ZShipley, JRaynaud, FIWestaway, SMPrinjha, RKFedorov, OBurke, RSchofield, CJWestwood, IMBountra, CMüller, Svan Montfort, RLBrennan, PEBlagg, J 8-Substituted Pyrido[3,4-d]pyrimidin-4(3H)-one Derivatives As Potent, Cell Permeable, KDM4 (JMJD2) and KDM5 (JARID1) Histone Lysine Demethylase Inhibitors. J Med Chem59:1388-409 (2016) 
 
Lysine-specific demethylase 4B
Name:Lysine-specific demethylase 4B
Type:PROTEIN
Mol. Mass.:121904.33
Organism:Homo sapiens (Human)
Description:ChEMBL_109446
Residue:1096
BDBM50153153
NameBDBM50153153
Synonyms:CHEMBL3774765
TypeSmall organic molecule
Emp. Form.C13H12N4O2
Mol. Mass.256.26
SMILESO=c1[nH]cnc2c(CNCc3ccco3)nccc12