Reaction Details
TargetLysine-specific demethylase 5C
LigandBDBM50151917
Substrate/Competitorn/a
Meas. Tech.ChEMBL_1561972 (CHEMBL3778979)
IC50 70±n/a nM
Citation Bavetsias, VLanigan, RMRuda, GFAtrash, BMcLaughlin, MGTumber, AMok, NYLe Bihan, YVDempster, SBoxall, KJJeganathan, FHatch, SBSavitsky, PVelupillai, SKrojer, TEngland, KSSejberg, JThai, CDonovan, APal, AScozzafava, GBennett, JMKawamura, AJohansson, CSzykowska, AGileadi, CBurgess-Brown, NAvon Delft, FOppermann, UWalters, ZShipley, JRaynaud, FIWestaway, SMPrinjha, RKFedorov, OBurke, RSchofield, CJWestwood, IMBountra, CMüller, Svan Montfort, RLBrennan, PEBlagg, J 8-Substituted Pyrido[3,4-d]pyrimidin-4(3H)-one Derivatives As Potent, Cell Permeable, KDM4 (JMJD2) and KDM5 (JARID1) Histone Lysine Demethylase Inhibitors. J Med Chem59:1388-409 (2016) 
 
Lysine-specific demethylase 5C
Name:Lysine-specific demethylase 5C
Type:PROTEIN
Mol. Mass.:175691.17
Organism:Homo sapiens (Human)
Description:P41229
Residue:1560
BDBM50151917
NameBDBM50151917
Synonyms:CHEMBL3775548
TypeSmall organic molecule
Emp. Form.C24H23F3N6O
Mol. Mass.468.4742
SMILESFC(F)(F)c1cccc(c1)C1CCN(CCc2cnn(c2)-c2nccc3c2nc[nH]c3=O)CC1