Reaction Details
TargetLysine-specific demethylase 5C
LigandBDBM50151919
Substrate/Competitorn/a
Meas. Tech.ChEMBL_1561972 (CHEMBL3778979)
IC50 54±n/a nM
Citation Bavetsias, VLanigan, RMRuda, GFAtrash, BMcLaughlin, MGTumber, AMok, NYLe Bihan, YVDempster, SBoxall, KJJeganathan, FHatch, SBSavitsky, PVelupillai, SKrojer, TEngland, KSSejberg, JThai, CDonovan, APal, AScozzafava, GBennett, JMKawamura, AJohansson, CSzykowska, AGileadi, CBurgess-Brown, NAvon Delft, FOppermann, UWalters, ZShipley, JRaynaud, FIWestaway, SMPrinjha, RKFedorov, OBurke, RSchofield, CJWestwood, IMBountra, CMüller, Svan Montfort, RLBrennan, PEBlagg, J 8-Substituted Pyrido[3,4-d]pyrimidin-4(3H)-one Derivatives As Potent, Cell Permeable, KDM4 (JMJD2) and KDM5 (JARID1) Histone Lysine Demethylase Inhibitors. J Med Chem59:1388-409 (2016) 
 
Lysine-specific demethylase 5C
Name:Lysine-specific demethylase 5C
Type:PROTEIN
Mol. Mass.:175691.17
Organism:Homo sapiens (Human)
Description:P41229
Residue:1560
BDBM50151919
NameBDBM50151919
Synonyms:CHEMBL3775121
TypeSmall organic molecule
Emp. Form.C23H22F2N6O
Mol. Mass.436.4572
SMILESFc1ccc(C2CCN(CCc3cnn(c3)-c3nccc4c3nc[nH]c4=O)CC2)c(F)c1