Reaction Details
TargetGlycogen phosphorylase, muscle form
LigandBDBM50150645
Substrate/Competitorn/a
Meas. Tech.ChEMBL_1558648 (CHEMBL3771525)
IC50 3400±n/a nM
Citation Loughlin, WAJenkins, IDKaris, NDSchweiker, SSHealy, PC 2-Oxo-1,2-dihydropyridinyl-3-yl amide-based GPa inhibitors: Design, synthesis and structure-activity relationship study. Eur J Med Chem111:1-14 (2016) 
 
Glycogen phosphorylase, muscle form
Name:Glycogen phosphorylase, muscle form
Type:Enzyme
Mol. Mass.:97296.32
Organism:Oryctolagus cuniculus (rabbit)
Description:Phosphorylation of Ser-15 converts phosphorylase B (unphosphorylated) to phosphorylase A.
Residue:843
BDBM50150645
NameBDBM50150645
Synonyms:CHEMBL3771019
TypeSmall organic molecule
Emp. Form.C26H24Cl2N4O4S
Mol. Mass.559.464
SMILESCc1ccc(cc1)S(=O)(=O)n1cccc1CNc1cccn(CC(=O)NCc2ccc(Cl)c(Cl)c2)c1=O