Reaction Details
TargetRibosyldihydronicotinamide dehydrogenase [quinone]
LigandBDBM50150963
Substrate/Competitorn/a
Meas. Tech.ChEMBL_1558657 (CHEMBL3771534)
IC50 15±n/a nM
Citation Alnabulsi, SSantina, ERusso, IHussein, BKadirvel, MChadwick, ABichenkova, EVBryce, RANolan, KDemonacos, CStratford, IJFreeman, S Non-symmetrical furan-amidines as novel leads for the treatment of cancer and malaria. Eur J Med Chem111:33-45 (2016) 
 
Ribosyldihydronicotinamide dehydrogenase [quinone]
Name:Ribosyldihydronicotinamide dehydrogenase [quinone]
Type:Protein
Mol. Mass.:25917.25
Organism:Homo sapiens (Human)
Description:P16083
Residue:231
BDBM50150963
NameBDBM50150963
Synonyms:CHEMBL3770674
TypeSmall organic molecule
Emp. Form.C19H17N3O5
Mol. Mass.367.3554
SMILESCC(O)=O.NC(=N)c1ccc(cc1)-c1ccc(o1)-c1cccc(c1)[N+]([O-])=O