Reaction Details
TargetN-acylethanolamine-hydrolyzing acid amidase
LigandBDBM50151149
Substrate/Competitorn/a
Meas. Tech.ChEMBL_1558879 (CHEMBL3772811)
IC50 73±n/a nM
Citation Nuzzi, AFiasella, AOrtega, JAPagliuca, CPonzano, SPizzirani, DBertozzi, SMOttonello, GTarozzo, GReggiani, ABandiera, TBertozzi, FPiomelli, D Potenta-amino-ß-lactam carbamic acid ester as NAAA inhibitors. Synthesis and structure-activity relationship (SAR) studies. Eur J Med Chem111:138-59 (2016) 
 
N-acylethanolamine-hydrolyzing acid amidase
Name:N-acylethanolamine-hydrolyzing acid amidase
Type:Enzyme
Mol. Mass.:40073.12
Organism:Homo sapiens (Human)
Description:Q02083
Residue:359
BDBM50151149
NameBDBM50151149
Synonyms:CHEMBL3769639
TypeSmall organic molecule
Emp. Form.C15H17F3N2O3
Mol. Mass.330.3023
SMILESFC(F)(F)c1ccc(CCCCOC(=O)N[C@H]2CNC2=O)cc1