Reaction Details
TargetN-acylethanolamine-hydrolyzing acid amidase
LigandBDBM50151220
Substrate/Competitorn/a
Meas. Tech.ChEMBL_1558877 (CHEMBL3772809)
IC50 76±n/a nM
Citation Nuzzi, AFiasella, AOrtega, JAPagliuca, CPonzano, SPizzirani, DBertozzi, SMOttonello, GTarozzo, GReggiani, ABandiera, TBertozzi, FPiomelli, D Potenta-amino-ß-lactam carbamic acid ester as NAAA inhibitors. Synthesis and structure-activity relationship (SAR) studies. Eur J Med Chem111:138-59 (2016) 
 
N-acylethanolamine-hydrolyzing acid amidase
Name:N-acylethanolamine-hydrolyzing acid amidase
Type:Enzyme
Mol. Mass.:40073.12
Organism:Homo sapiens (Human)
Description:Q02083
Residue:359
BDBM50151220
NameBDBM50151220
Synonyms:CHEMBL3769678
TypeSmall organic molecule
Emp. Form.C14H22F2N2O3
Mol. Mass.304.3329
SMILESFC1(F)CCC(CCCCOC(=O)N[C@H]2CNC2=O)CC1