Reaction Details
Target5-hydroxytryptamine receptor 1A
LigandBDBM50151272
Substrate/Competitorn/a
Meas. Tech.ChEMBL_1559080 (CHEMBL3773936)
Ki<1000±n/a nM
Citation Franchini, SBattisti, UMPrandi, ATait, ABorsari, CCichero, EFossa, PCilia, APrezzavento, ORonsisvalle, SAricò, GParenti, CBrasili, L Scouting new sigma receptor ligands: Synthesis, pharmacological evaluation and molecular modeling of 1,3-dioxolane-based structures and derivatives. Eur J Med Chem112:1-19 (2016) 
 
5-hydroxytryptamine receptor 1A
Name:5-hydroxytryptamine receptor 1A
Type:n/a
Mol. Mass.:46122.49
Organism:Homo sapiens (Human)
Description:n/a
Residue:422
BDBM50151272
NameBDBM50151272
Synonyms:CHEMBL3769930
TypeSmall organic molecule
Emp. Form.C20H30N2O2
Mol. Mass.330.4644
SMILESC(C1COC2(CCCCC2)O1)N1CCN(Cc2ccccc2)CC1