Reaction Details
TargetG-protein coupled receptor 55
LigandBDBM61592
Substrate/Competitorn/a
Meas. Tech.ChEMBL_1561203 (CHEMBL3777631)
IC50 640±n/a nM
Citation Meza-Aviņa, MELingerfelt, MAConsole-Bram, LMGamage, TFSharir, HGettys, KEHurst, DPKotsikorou, EShore, DMCaron, MGRao, NBarak, LSAbood, MEReggio, PHCroatt, MP Design, synthesis, and analysis of antagonists of GPR55: Piperidine-substituted 1,3,4-oxadiazol-2-ones. Bioorg Med Chem Lett26:1827-30 (2016) 
 
G-protein coupled receptor 55
Name:G-protein coupled receptor 55
Type:PROTEIN
Mol. Mass.:36649.72
Organism:Homo sapiens (Human)
Description:ChEMBL_1292265
Residue:319
BDBM61592
NameBDBM61592
Synonyms:3-[1-[1-(4-chlorophenyl)cyclopropanecarbonyl]-4-piperidyl]-5-phenyl-1,3,4-oxadiazol-2-one 3-[1-[1-(4-chlorophenyl)cyclopropyl]carbonylpiperidin-4-yl]-5-phenyl-1,3,4-oxadiazol-2-one MLS001116134 cid_23612567
TypeSmall organic molecule
Emp. Form.C23H22ClN3O3
Mol. Mass.423.892
SMILESClc1ccc(cc1)C1(CC1)C(=O)N1CCC(CC1)n1nc(oc1=O)-c1ccccc1