Reaction Details
TargetCoagulation factor IX
LigandBDBM50153888
Substrate/Competitorn/a
Meas. Tech.ChEMBL_1560117 (CHEMBL3778013)
IC50 11±n/a nM
Citation Zhang, TLiu, YYang, XMartin, GEYao, HShang, JBugianesi, RMEllsworth, KPSonatore, LMNizner, PSherer, ECHill, SEKnemeyer, IWGeissler, WMDandliker, PJHelmy, RWood, HB Definitive Metabolite Identification Coupled with Automated Ligand Identification System (ALIS) Technology: A Novel Approach to Uncover Structure-Activity Relationships and Guide Drug Design in a Factor IXa Inhibitor Program. J Med Chem59:1818-29 (2016) 
 
Coagulation factor IX
Name:Coagulation factor IX
Type:Enzyme
Mol. Mass.:51768.83
Organism:Homo sapiens (Human)
Description:P00740
Residue:461
BDBM50153888
NameBDBM50153888
Synonyms:CHEMBL3774998
TypeSmall organic molecule
Emp. Form.C26H21Cl2FN6O2
Mol. Mass.539.388
SMILESCc1nc2cc(ccc2[nH]1)[C@@H](CNC(=O)c1c(Cl)cc(cc1Cl)-n1cnc(CO)n1)c1cccc(F)c1