Reaction Details
TargetTranscription intermediary factor 1-alpha
LigandBDBM50150828
Substrate/Competitorn/a
Meas. Tech.ChEMBL_1560318 (CHEMBL3779310)
IC50 4900±n/a nM
Citation Palmer, WSPoncet-Montange, GLiu, GPetrocchi, AReyna, NSubramanian, GTheroff, JYau, AKost-Alimova, MBardenhagen, JPLeo, EShepard, HETieu, TNShi, XZhan, YZhao, SBarton, MCDraetta, GToniatti, CJones, PGeck Do, MAndersen, JN Structure-Guided Design of IACS-9571, a Selective High-Affinity Dual TRIM24-BRPF1 Bromodomain Inhibitor. J Med Chem59:1440-54 (2016) 
 
Transcription intermediary factor 1-alpha
Name:Transcription intermediary factor 1-alpha
Type:PROTEIN
Mol. Mass.:116839.55
Organism:Homo sapiens (Human)
Description:ChEMBL_107998
Residue:1050
BDBM50150828
NameBDBM50150828
Synonyms:CHEMBL3774650
TypeSmall organic molecule
Emp. Form.C16H17N3O3S2
Mol. Mass.363.454
SMILESCSc1ccc(cc1)S(=O)(=O)Nc1ccc2n(C)c(=O)n(C)c2c1