Reaction Details
TargetBromodomain and PHD finger-containing protein 3
LigandBDBM50150818
Substrate/Competitorn/a
Meas. Tech.ChEMBL_1560331 (CHEMBL3779323)
Kd 27±n/a nM
Citation Palmer, WSPoncet-Montange, GLiu, GPetrocchi, AReyna, NSubramanian, GTheroff, JYau, AKost-Alimova, MBardenhagen, JPLeo, EShepard, HETieu, TNShi, XZhan, YZhao, SBarton, MCDraetta, GToniatti, CJones, PGeck Do, MAndersen, JN Structure-Guided Design of IACS-9571, a Selective High-Affinity Dual TRIM24-BRPF1 Bromodomain Inhibitor. J Med Chem59:1440-54 (2016) 
 
Bromodomain and PHD finger-containing protein 3
Name:Bromodomain and PHD finger-containing protein 3
Type:PROTEIN
Mol. Mass.:135743.95
Organism:Homo sapiens (Human)
Description:ChEMBL_108004
Residue:1205
BDBM50150818
NameBDBM50150818
Synonyms:CHEMBL3774575
TypeSmall organic molecule
Emp. Form.C32H42N4O8S
Mol. Mass.642.763
SMILESCCCOc1cc(OCCCCN(C)C)cc(Oc2cc3n(C)c(=O)n(C)c3cc2NS(=O)(=O)c2ccc(OC)c(OC)c2)c1