Reaction Details
TargetTranscription initiation factor TFIID subunit 1
LigandBDBM50150818
Substrate/Competitorn/a
Meas. Tech.ChEMBL_1560333 (CHEMBL3779325)
Kd 1800±n/a nM
Citation Palmer, WSPoncet-Montange, GLiu, GPetrocchi, AReyna, NSubramanian, GTheroff, JYau, AKost-Alimova, MBardenhagen, JPLeo, EShepard, HETieu, TNShi, XZhan, YZhao, SBarton, MCDraetta, GToniatti, CJones, PGeck Do, MAndersen, JN Structure-Guided Design of IACS-9571, a Selective High-Affinity Dual TRIM24-BRPF1 Bromodomain Inhibitor. J Med Chem59:1440-54 (2016) 
 
Transcription initiation factor TFIID subunit 1
Name:Transcription initiation factor TFIID subunit 1
Type:PROTEIN
Mol. Mass.:212598.75
Organism:Homo sapiens (Human)
Description:ChEMBL_108248
Residue:1872
BDBM50150818
NameBDBM50150818
Synonyms:CHEMBL3774575
TypeSmall organic molecule
Emp. Form.C32H42N4O8S
Mol. Mass.642.763
SMILESCCCOc1cc(OCCCCN(C)C)cc(Oc2cc3n(C)c(=O)n(C)c3cc2NS(=O)(=O)c2ccc(OC)c(OC)c2)c1