Reaction Details
TargetB2 bradykinin receptor
LigandBDBM50146899
Substrate/Competitorn/a
Meas. Tech.ChEMBL_1560590 (CHEMBL3777322)
IC50 0.410000±n/a nM
Citation Dosa, PIAmin, EA Tactical Approaches to Interconverting GPCR Agonists and Antagonists. J Med Chem59:810-40 (2016) 
 
B2 bradykinin receptor
Name:B2 bradykinin receptor
Type:Enzyme Catalytic Domain
Mol. Mass.:44467.17
Organism:Homo sapiens (Human)
Description:B2 BRADYKININ BDKRB2 HUMAN::P30411
Residue:391
BDBM50146899
NameBDBM50146899
Synonyms:4-((E)-2-{[({2,4-Dichloro-3-[2-methyl-4-(pyridin-2-ylmethoxy)-quinolin-8-yloxymethyl]-phenyl}-methyl-carbamoyl)-methyl]-carbamoyl}-vinyl)-N-methyl-benzamide | CHEMBL99869
TypeSmall organic molecule
Emp. Form.C37H33Cl2N5O5
Mol. Mass.698.594
SMILESCNC(=O)c1ccc(\C=C\C(=O)NCC(=O)N(C)c2ccc(Cl)c(COc3cccc4c(OCc5ccccn5)cc(C)nc34)c2Cl)cc1