Reaction Details
Target5-hydroxytryptamine receptor 7
LigandBDBM21367
Substrate/Competitorn/a
Meas. Tech.ChEMBL_1560587 (CHEMBL3777319)
Ki 0.220000±n/a nM
Citation Dosa, PIAmin, EA Tactical Approaches to Interconverting GPCR Agonists and Antagonists. J Med Chem59:810-40 (2016) 
 
5-hydroxytryptamine receptor 7
Name:5-hydroxytryptamine receptor 7
Type:G Protein-Coupled Receptor (GPCR)
Mol. Mass.:49852.62
Organism:Rattus norvegicus (rat)
Description:Rat cloned 5-HT7R.
Residue:448
BDBM21367
NameBDBM21367
Synonyms:6-{4-[2-(methylsulfanyl)phenyl]piperazin-1-yl}-N-(1,2,3,4-tetrahydronaphthalen-1-yl)hexanamide LP-44 | Piperazinehexanamide derivative, 5
TypeSmall organic molecule
Emp. Form.C27H37N3OS
Mol. Mass.451.667
SMILESCSc1ccccc1N1CCN(CCCCCC(=O)NC2CCCc3ccccc23)CC1