Reaction Details
TargetMelatonin receptor type 1B
LigandBDBM50114703
Substrate/Competitorn/a
Meas. Tech.ChEMBL_1560584 (CHEMBL3777316)
Ki 0.020000±n/a nM
Citation Dosa, PIAmin, EA Tactical Approaches to Interconverting GPCR Agonists and Antagonists. J Med Chem59:810-40 (2016) 
 
Melatonin receptor type 1B
Name:Melatonin receptor type 1B
Type:Enzyme
Mol. Mass.:40203.54
Organism:Homo sapiens (Human)
Description:P49286
Residue:362
BDBM50114703
NameBDBM50114703
Synonyms:CHEMBL287560 | N-[2-(5-Methoxy-2-phenyl-benzofuran-3-yl)-ethyl]-acetamide
TypeSmall organic molecule
Emp. Form.C19H19NO3
Mol. Mass.309.3591
SMILESCOc1ccc2oc(c(CCNC(C)=O)c2c1)-c1ccccc1