Reaction Details
TargetHistamine H3 receptor
LigandBDBM50409216
Substrate/Competitorn/a
Meas. Tech.ChEMBL_1560578 (CHEMBL3777310)
Ki 20±n/a nM
Citation Dosa, PIAmin, EA Tactical Approaches to Interconverting GPCR Agonists and Antagonists. J Med Chem59:810-40 (2016) 
 
Histamine H3 receptor
Name:Histamine H3 receptor
Type:G Protein-Coupled Receptor (GPCR)
Mol. Mass.:48691.47
Organism:Homo sapiens (Human)
Description:Binding assays were using CHO cells stably expressing hH3R receptors.
Residue:445
BDBM50409216
NameBDBM50409216
Synonyms:CHEMBL150701
TypeSmall organic molecule
Emp. Form.C10H17N3
Mol. Mass.179.2621
SMILESC(Cc1cnc[nH]1)C1CCNCC1