Reaction Details
TargetKappa-type opioid receptor
LigandBDBM50367061
Substrate/Competitorn/a
Meas. Tech.ChEMBL_1560573 (CHEMBL3777305)
Ki 2.0±n/a nM
Citation Dosa, PIAmin, EA Tactical Approaches to Interconverting GPCR Agonists and Antagonists. J Med Chem59:810-40 (2016) 
 
Kappa-type opioid receptor
Name:Kappa-type opioid receptor
Type:G Protein-Coupled Receptor (GPCR)
Mol. Mass.:42648.76
Organism:Homo sapiens (Human)
Description:P41145
Residue:380
BDBM50367061
NameBDBM50367061
Synonyms:NALORPHINE | NALORPHINE HYDROCHLORIDE
TypeSmall organic molecule
Emp. Form.C19H21NO3
Mol. Mass.311.3749
SMILESO[C@H]1C=C[C@H]2[C@H]3Cc4ccc(O)c5O[C@@H]1[C@]2(CCN3CC=C)c45