Reaction Details
TargetHistone deacetylase 6
LigandBDBM50150946
Substrate/Competitorn/a
Meas. Tech.ChEMBL_1560779 (CHEMBL3778476)
IC50>1000±n/a nM
Citation Yang, ZWang, TWang, FNiu, TLiu, ZChen, XLong, CTang, MCao, DWang, XXiang, WYi, YMa, LYou, JChen, L Discovery of Selective Histone Deacetylase 6 Inhibitors Using the Quinazoline as the Cap for the Treatment of Cancer. J Med Chem59:1455-70 (2016) 
 
Histone deacetylase 6
Name:Histone deacetylase 6
Type:Chromatin regulator; hydrolase; repressor
Mol. Mass.:131381.51
Organism:Homo sapiens (Human)
Description:Q9UBN7
Residue:1215
BDBM50150946
NameBDBM50150946
Synonyms:CHEMBL3775457
TypeSmall organic molecule
Emp. Form.C20H22N4O4
Mol. Mass.382.4131
SMILESCOc1ccc(Nc2nc(C)nc3ccccc23)cc1OCCCC(=O)NO