Reaction Details
TargetHistone deacetylase 6
LigandBDBM50151378
Substrate/Competitorn/a
Meas. Tech.ChEMBL_1560779 (CHEMBL3778476)
IC50 8.6±n/a nM
Citation Yang, ZWang, TWang, FNiu, TLiu, ZChen, XLong, CTang, MCao, DWang, XXiang, WYi, YMa, LYou, JChen, L Discovery of Selective Histone Deacetylase 6 Inhibitors Using the Quinazoline as the Cap for the Treatment of Cancer. J Med Chem59:1455-70 (2016) 
 
Histone deacetylase 6
Name:Histone deacetylase 6
Type:Chromatin regulator; hydrolase; repressor
Mol. Mass.:131381.51
Organism:Homo sapiens (Human)
Description:Q9UBN7
Residue:1215
BDBM50151378
NameBDBM50151378
Synonyms:CHEMBL3775521
TypeSmall organic molecule
Emp. Form.C18H18N4O3
Mol. Mass.338.3605
SMILESCN(c1ccc(OCC(=O)NO)cc1)c1nc(C)nc2ccccc12