Reaction Details
TargetHistone deacetylase 8
LigandBDBM50151325
Substrate/Competitorn/a
Meas. Tech.ChEMBL_1560780 (CHEMBL3778477)
IC50 1003±n/a nM
Citation Yang, ZWang, TWang, FNiu, TLiu, ZChen, XLong, CTang, MCao, DWang, XXiang, WYi, YMa, LYou, JChen, L Discovery of Selective Histone Deacetylase 6 Inhibitors Using the Quinazoline as the Cap for the Treatment of Cancer. J Med Chem59:1455-70 (2016) 
 
Histone deacetylase 8
Name:Histone deacetylase 8
Type:Enzyme
Mol. Mass.:41749.60
Organism:Homo sapiens (Human)
Description:Q9BY41
Residue:377
BDBM50151325
NameBDBM50151325
Synonyms:CHEMBL3775072
TypeSmall organic molecule
Emp. Form.C21H28N4O3
Mol. Mass.384.472
SMILESCN(c1ccc(OCCCCCC(=O)NO)cc1)c1nc(C)nc2CCCc12