Reaction Details
TargetHistone deacetylase 6
LigandBDBM50151375
Substrate/Competitorn/a
Meas. Tech.ChEMBL_1560783 (CHEMBL3778480)
EC50 59±n/a nM
Citation Yang, ZWang, TWang, FNiu, TLiu, ZChen, XLong, CTang, MCao, DWang, XXiang, WYi, YMa, LYou, JChen, L Discovery of Selective Histone Deacetylase 6 Inhibitors Using the Quinazoline as the Cap for the Treatment of Cancer. J Med Chem59:1455-70 (2016) 
 
Histone deacetylase 6
Name:Histone deacetylase 6
Type:Chromatin regulator; hydrolase; repressor
Mol. Mass.:131381.51
Organism:Homo sapiens (Human)
Description:Q9UBN7
Residue:1215
BDBM50151375
NameBDBM50151375
Synonyms:CHEMBL3774414
TypeSmall organic molecule
Emp. Form.C21H24N4O4
Mol. Mass.396.4397
SMILESCOc1ccc(cc1OCCCC(=O)NO)N(C)c1nc(C)nc2ccccc12