Reaction Details
TargetHistone deacetylase 7
LigandBDBM50151375
Substrate/Competitorn/a
Meas. Tech.ChEMBL_1560791 (CHEMBL3778488)
IC50>10000±n/a nM
Citation Yang, ZWang, TWang, FNiu, TLiu, ZChen, XLong, CTang, MCao, DWang, XXiang, WYi, YMa, LYou, JChen, L Discovery of Selective Histone Deacetylase 6 Inhibitors Using the Quinazoline as the Cap for the Treatment of Cancer. J Med Chem59:1455-70 (2016) 
 
Histone deacetylase 7
Name:Histone deacetylase 7
Type:Chromatin regulator; hydrolase; repressor
Mol. Mass.:102942.62
Organism:Homo sapiens (Human)
Description:Q8WUI4
Residue:952
BDBM50151375
NameBDBM50151375
Synonyms:CHEMBL3774414
TypeSmall organic molecule
Emp. Form.C21H24N4O4
Mol. Mass.396.4397
SMILESCOc1ccc(cc1OCCCC(=O)NO)N(C)c1nc(C)nc2ccccc12