Reaction Details
TargetHistone deacetylase 11
LigandBDBM50439674
Substrate/Competitorn/a
Meas. Tech.ChEMBL_1560794 (CHEMBL3778491)
IC50>10000±n/a nM
Citation Yang, ZWang, TWang, FNiu, TLiu, ZChen, XLong, CTang, MCao, DWang, XXiang, WYi, YMa, LYou, JChen, L Discovery of Selective Histone Deacetylase 6 Inhibitors Using the Quinazoline as the Cap for the Treatment of Cancer. J Med Chem59:1455-70 (2016) 
 
Histone deacetylase 11
Name:Histone deacetylase 11
Type:Chromatin regulator; hydrolase; repressor
Mol. Mass.:39187.66
Organism:Homo sapiens (Human)
Description:Q96DB2
Residue:347
BDBM50439674
NameBDBM50439674
Synonyms:RICOLINOSTAT US11207431, Example E US8609678, 2-(diphenylamino)-N-(7-(hydroxyamino)-7-oxoheptyl)pyrimidine-5-carboxamide [26]
TypeSmall organic molecule
Emp. Form.C24H27N5O3
Mol. Mass.433.5029
SMILESONC(=O)CCCCCCNC(=O)c1cnc(nc1)N(c1ccccc1)c1ccccc1