Reaction Details
TargetLysine-specific demethylase 4C
LigandBDBM50151388
Substrate/Competitorn/a
Meas. Tech.ChEMBL_1561029 (CHEMBL3776325)
IC50 8300±n/a nM
Citation Korczynska, MLe, DDYounger, NGregori-Puigjané, ETumber, AKrojer, TVelupillai, SGileadi, CNowak, RPIwasa, EPollock, SBOrtiz Torres, IOppermann, UShoichet, BKFujimori, DG Docking and Linking of Fragments To Discover Jumonji Histone Demethylase Inhibitors. J Med Chem59:1580-98 (2016) 
 
Lysine-specific demethylase 4C
Name:Lysine-specific demethylase 4C
Type:Protein
Mol. Mass.:119979.01
Organism:Homo sapiens (Human)
Description:Q9H3R0
Residue:1056
BDBM50151388
NameBDBM50151388
Synonyms:CHEMBL3775869
TypeSmall organic molecule
Emp. Form.C12H10N2O3
Mol. Mass.230.2194
SMILESNc1ccc(O)c(c1)-c1cc(ccn1)C(O)=O