Reaction Details
TargetLysine-specific demethylase 4C
LigandBDBM50151391
Substrate/Competitorn/a
Meas. Tech.ChEMBL_1561029 (CHEMBL3776325)
IC50 460±n/a nM
Citation Korczynska, MLe, DDYounger, NGregori-Puigjané, ETumber, AKrojer, TVelupillai, SGileadi, CNowak, RPIwasa, EPollock, SBOrtiz Torres, IOppermann, UShoichet, BKFujimori, DG Docking and Linking of Fragments To Discover Jumonji Histone Demethylase Inhibitors. J Med Chem59:1580-98 (2016) 
 
Lysine-specific demethylase 4C
Name:Lysine-specific demethylase 4C
Type:Protein
Mol. Mass.:119979.01
Organism:Homo sapiens (Human)
Description:Q9H3R0
Residue:1056
BDBM50151391
NameBDBM50151391
Synonyms:CHEMBL3774611
TypeSmall organic molecule
Emp. Form.C19H14N2O5
Mol. Mass.350.3249
SMILESOC(=O)c1ccnc(c1)-c1cc(NC(=O)c2cccc(O)c2)ccc1O