Reaction Details
TargetLysine-specific demethylase 4C
LigandBDBM50151399
Substrate/Competitorn/a
Meas. Tech.ChEMBL_1561029 (CHEMBL3776325)
IC50 140±n/a nM
Citation Korczynska, MLe, DDYounger, NGregori-Puigjané, ETumber, AKrojer, TVelupillai, SGileadi, CNowak, RPIwasa, EPollock, SBOrtiz Torres, IOppermann, UShoichet, BKFujimori, DG Docking and Linking of Fragments To Discover Jumonji Histone Demethylase Inhibitors. J Med Chem59:1580-98 (2016) 
 
Lysine-specific demethylase 4C
Name:Lysine-specific demethylase 4C
Type:Protein
Mol. Mass.:119979.01
Organism:Homo sapiens (Human)
Description:Q9H3R0
Residue:1056
BDBM50151399
NameBDBM50151399
Synonyms:CHEMBL3775380
TypeSmall organic molecule
Emp. Form.C15H14N2O5
Mol. Mass.302.2821
SMILESCOCC(=O)Nc1ccc(O)c(c1)-c1cc(ccn1)C(O)=O