Reaction Details
TargetLysine-specific demethylase 4C
LigandBDBM50151393
Substrate/Competitorn/a
Meas. Tech.ChEMBL_1561030 (CHEMBL3776326)
IC50 5000±n/a nM
Citation Korczynska, MLe, DDYounger, NGregori-Puigjané, ETumber, AKrojer, TVelupillai, SGileadi, CNowak, RPIwasa, EPollock, SBOrtiz Torres, IOppermann, UShoichet, BKFujimori, DG Docking and Linking of Fragments To Discover Jumonji Histone Demethylase Inhibitors. J Med Chem59:1580-98 (2016) 
 
Lysine-specific demethylase 4C
Name:Lysine-specific demethylase 4C
Type:Protein
Mol. Mass.:119979.01
Organism:Homo sapiens (Human)
Description:Q9H3R0
Residue:1056
BDBM50151393
NameBDBM50151393
Synonyms:CHEMBL3775867
TypeSmall organic molecule
Emp. Form.C17H13N3O5
Mol. Mass.339.3022
SMILESCc1cc(no1)C(=O)Nc1ccc(O)c(c1)-c1cc(ccn1)C(O)=O