Reaction Details
TargetHypoxia-inducible factor 1-alpha inhibitor
LigandBDBM50151397
Substrate/Competitorn/a
Meas. Tech.ChEMBL_1561035 (CHEMBL3776331)
IC50>500000±n/a nM
Citation Korczynska, MLe, DDYounger, NGregori-Puigjané, ETumber, AKrojer, TVelupillai, SGileadi, CNowak, RPIwasa, EPollock, SBOrtiz Torres, IOppermann, UShoichet, BKFujimori, DG Docking and Linking of Fragments To Discover Jumonji Histone Demethylase Inhibitors. J Med Chem59:1580-98 (2016) 
 
Hypoxia-inducible factor 1-alpha inhibitor
Name:Hypoxia-inducible factor 1-alpha inhibitor
Type:Enzyme
Mol. Mass.:40278.92
Organism:Homo sapiens (Human)
Description:Q9NWT6
Residue:349
BDBM50151397
NameBDBM50151397
Synonyms:CHEMBL3775272
TypeSmall organic molecule
Emp. Form.C21H18N2O5
Mol. Mass.378.378
SMILESCOc1cccc(CC(=O)Nc2ccc(O)c(c2)-c2cc(ccn2)C(O)=O)c1