Reaction Details
TargetLysine-specific demethylase 4C
LigandBDBM50151401
Substrate/Competitorn/a
Meas. Tech.ChEMBL_1561037 (CHEMBL3776333)
IC50 15000±n/a nM
Citation Korczynska, MLe, DDYounger, NGregori-Puigjané, ETumber, AKrojer, TVelupillai, SGileadi, CNowak, RPIwasa, EPollock, SBOrtiz Torres, IOppermann, UShoichet, BKFujimori, DG Docking and Linking of Fragments To Discover Jumonji Histone Demethylase Inhibitors. J Med Chem59:1580-98 (2016) 
 
Lysine-specific demethylase 4C
Name:Lysine-specific demethylase 4C
Type:Protein
Mol. Mass.:119979.01
Organism:Homo sapiens (Human)
Description:Q9H3R0
Residue:1056
BDBM50151401
NameBDBM50151401
Synonyms:CHEMBL3774598
TypeSmall organic molecule
Emp. Form.C14H12N2O4
Mol. Mass.272.2561
SMILESCC(=O)Nc1ccc(O)c(c1)-c1cc(ccn1)C(O)=O