Reaction Details
TargetLysine-specific demethylase 2A
LigandBDBM50151392
Substrate/Competitorn/a
Meas. Tech.ChEMBL_1561038 (CHEMBL3776334)
IC50 89000±n/a nM
Citation Korczynska, MLe, DDYounger, NGregori-Puigjané, ETumber, AKrojer, TVelupillai, SGileadi, CNowak, RPIwasa, EPollock, SBOrtiz Torres, IOppermann, UShoichet, BKFujimori, DG Docking and Linking of Fragments To Discover Jumonji Histone Demethylase Inhibitors. J Med Chem59:1580-98 (2016) 
 
Lysine-specific demethylase 2A
Name:Lysine-specific demethylase 2A
Type:Enzyme Catalytic Domain
Mol. Mass.:132809.04
Organism:Homo sapiens (Human)
Description:n/a
Residue:1162
BDBM50151392
NameBDBM50151392
Synonyms:CHEMBL3775262
TypeSmall organic molecule
Emp. Form.C19H14N2O5
Mol. Mass.350.3249
SMILESOC(=O)c1ccnc(c1)-c1cc(NC(=O)c2ccc(O)cc2)ccc1O