Reaction Details
TargetLysine-specific demethylase 4D
LigandBDBM26113
Substrate/Competitorn/a
Meas. Tech.ChEMBL_1561042 (CHEMBL3776338)
IC50 2400±n/a nM
Citation Korczynska, MLe, DDYounger, NGregori-Puigjané, ETumber, AKrojer, TVelupillai, SGileadi, CNowak, RPIwasa, EPollock, SBOrtiz Torres, IOppermann, UShoichet, BKFujimori, DG Docking and Linking of Fragments To Discover Jumonji Histone Demethylase Inhibitors. J Med Chem59:1580-98 (2016) 
 
Lysine-specific demethylase 4D
Name:Lysine-specific demethylase 4D
Type:PROTEIN
Mol. Mass.:58627.79
Organism:Homo sapiens (Human)
Description:ChEMBL_102441
Residue:523
BDBM26113
NameBDBM26113
Synonyms:2,4 PDCA pyridine carboxylate, 6a | pyridine-2,4-dicarboxylic acid
TypeSmall organic molecule
Emp. Form.C7H5NO4
Mol. Mass.167.1189
SMILESOC(=O)c1ccnc(c1)C(O)=O