Reaction Details
TargetHistone acetyltransferase KAT2B
LigandBDBM50151650
Substrate/Competitorn/a
Meas. Tech.ChEMBL_1561263 (CHEMBL3778083)
IC50 300±n/a nM
Citation Simon, RPRobaa, DAlhalabi, ZSippl, WJung, M KATching-Up on Small Molecule Modulators of Lysine Acetyltransferases. J Med Chem59:1249-70 (2016) 
 
Histone acetyltransferase KAT2B
Name:Histone acetyltransferase KAT2B
Type:PROTEIN
Mol. Mass.:93045.76
Organism:Homo sapiens (Human)
Description:ChEMBL_1502838
Residue:832
BDBM50151650
NameBDBM50151650
Synonyms:CHEMBL3775229
TypeSmall organic molecule
Emp. Form.C116H205N42O45P3S
Mol. Mass.3033.11
SMILESCNC(=O)C(C)NC(=O)C(CCCNC(N)=N)NC(=O)C(NC(=O)C(CCCCN)NC(=O)C(CCC(N)=O)NC(=O)C(NC(=O)C(C)NC(=O)C(CCCNC(N)=N)NC(=O)C(CC(C)C)NC(=O)C(CO)NC(=O)C(NC(=O)CNC(=O)CNC(=O)NC(CCCCNC(=O)CSCCNC(=O)CCNC(=O)C(O)C(C)(C)COP(O)(=O)OP(O)(=O)OCC1OC(C(O)C1OP(O)(O)=O)n1cnc2c(N)ncnc12)C(=O)NC(C)C(=O)N1CCCC1C(=O)NC(CCCNC(N)=N)C(=O)NC(CCCCN)C(=O)NC(CCC(N)=O)C(=O)NC(CC(C)C)C(O)=O)C(C)O)C(C)O)C(C)O