Reaction Details
TargetHistone acetyltransferase p300
LigandBDBM50346552
Substrate/Competitorn/a
Meas. Tech.ChEMBL_1561458 (CHEMBL3779392)
Ki 400±n/a nM
Citation Simon, RPRobaa, DAlhalabi, ZSippl, WJung, M KATching-Up on Small Molecule Modulators of Lysine Acetyltransferases. J Med Chem59:1249-70 (2016) 
 
Histone acetyltransferase p300
Name:Histone acetyltransferase p300
Type:Protein
Mol. Mass.:264223.04
Organism:Homo sapiens (Human)
Description:Q09472
Residue:2414
BDBM50346552
NameBDBM50346552
Synonyms:CHEMBL1797936
TypeSmall organic molecule
Emp. Form.C24H19N3O6
Mol. Mass.445.4242
SMILESCc1cc(-c2ccc(C=c3c(=C)[nH]n(-c4ccc(cc4)C(O)=O)c3=O)o2)c(cc1C)[N+]([O-])=O