Reaction Details
TargetFarnesyl pyrophosphate synthase
LigandBDBM50151859
Substrate/Competitorn/a
Meas. Tech.ChEMBL_1561703 (CHEMBL3777121)
IC50 28000±n/a nM
Citation Wills, VSAllen, CHolstein, SAWiemer, DF Potent Triazole Bisphosphonate Inhibitor of Geranylgeranyl Diphosphate Synthase. ACS Med Chem Lett6:1195-8 (2015) 
 
Farnesyl pyrophosphate synthase
Name:Farnesyl pyrophosphate synthase
Type:Enzyme
Mol. Mass.:48272.89
Organism:Homo sapiens (Human)
Description:P14324
Residue:419
BDBM50151859
NameBDBM50151859
Synonyms:CHEMBL3775876
TypeSmall organic molecule
Emp. Form.C15H23N3Na4O6P2
Mol. Mass.495.2662
SMILES[Na+].[Na+].[Na+].[Na+].[#6]\[#6](-[#6])=[#6]\[#6]-[#6]\[#6](-[#6])=[#6]\[#6]-[#6]-n1cc(-[#6]-[#6](P([#8-])([#8-])=O)P([#8-])([#8-])=O)nn1