Reaction Details
TargetGeranylgeranyl pyrophosphate synthase
LigandBDBM50151855
Substrate/Competitorn/a
Meas. Tech.ChEMBL_1561702 (CHEMBL3777120)
IC50 430±n/a nM
Citation Wills, VSAllen, CHolstein, SAWiemer, DF Potent Triazole Bisphosphonate Inhibitor of Geranylgeranyl Diphosphate Synthase. ACS Med Chem Lett6:1195-8 (2015) 
 
Geranylgeranyl pyrophosphate synthase
Name:Geranylgeranyl pyrophosphate synthase
Type:Homooctamer; transferase
Mol. Mass.:34867.94
Organism:Homo sapiens (Human)
Description:Recombinant human GGPPS was cloned and expressed in E. coli.
Residue:300
BDBM50151855
NameBDBM50151855
Synonyms:CHEMBL3775345
TypeSmall organic molecule
Emp. Form.C10H15N3Na4O6P2
Mol. Mass.427.1492
SMILES[Na+].[Na+].[Na+].[Na+].[#6]\[#6](-[#6])=[#6]\[#6]-[#6]-n1cc(-[#6]-[#6](P([#8-])([#8-])=O)P([#8-])([#8-])=O)nn1