Reaction Details
TargetCannabinoid receptor 2
LigandBDBM50151870
Substrate/Competitorn/a
Meas. Tech.ChEBML_1561407
EC50 637±n/a nM
Citation Aghazadeh Tabrizi, MBaraldi, PGRuggiero, ESaponaro, GBaraldi, SPoli, GTuccinardi, TRavani, AVincenzi, FBorea, PAVarani, K Synthesis and structure activity relationship investigation of triazolo[1,5-a]pyrimidines as CB2 cannabinoid receptor inverse agonists. Eur J Med Chem113:11-27 (2016) 
 
Cannabinoid receptor 2
Name:Cannabinoid receptor 2
Type:G Protein-Coupled Receptor (GPCR)
Mol. Mass.:39690.94
Organism:Homo sapiens (Human)
Description:P34972
Residue:360
BDBM50151870
NameBDBM50151870
Synonyms:CHEMBL3775267
TypeSmall organic molecule
Emp. Form.C27H32ClN5O2
Mol. Mass.494.028
SMILESCCCCCn1cc(C(=O)NC23CC4CC(CC(C4)C2)C3)c(=O)n2nc(nc12)-c1ccc(Cl)cc1