Reaction Details
TargetCannabinoid receptor 2
LigandBDBM50154631
Substrate/Competitorn/a
Meas. Tech.ChEMBL_1561403 (CHEMBL3778963)
Ki>10000±n/a nM
Citation Aghazadeh Tabrizi, MBaraldi, PGRuggiero, ESaponaro, GBaraldi, SPoli, GTuccinardi, TRavani, AVincenzi, FBorea, PAVarani, K Synthesis and structure activity relationship investigation of triazolo[1,5-a]pyrimidines as CB2 cannabinoid receptor inverse agonists. Eur J Med Chem113:11-27 (2016) 
 
Cannabinoid receptor 2
Name:Cannabinoid receptor 2
Type:G Protein-Coupled Receptor (GPCR)
Mol. Mass.:39690.94
Organism:Homo sapiens (Human)
Description:P34972
Residue:360
BDBM50154631
NameBDBM50154631
Synonyms:CHEMBL3774762
TypeSmall organic molecule
Emp. Form.C21H32N6O3
Mol. Mass.416.5172
SMILESCCCCCn1cc(C(=O)NC2CCCCC2)c(=O)n2nc(nc12)N1CCOCC1