Reaction Details
TargetCannabinoid receptor 1
LigandBDBM50426121
Substrate/Competitorn/a
Meas. Tech.ChEMBL_1561402 (CHEMBL3778962)
Ki 523±n/a nM
Citation Aghazadeh Tabrizi, MBaraldi, PGRuggiero, ESaponaro, GBaraldi, SPoli, GTuccinardi, TRavani, AVincenzi, FBorea, PAVarani, K Synthesis and structure activity relationship investigation of triazolo[1,5-a]pyrimidines as CB2 cannabinoid receptor inverse agonists. Eur J Med Chem113:11-27 (2016) 
 
Cannabinoid receptor 1
Name:Cannabinoid receptor 1
Type:G Protein-Coupled Receptor (GPCR)
Mol. Mass.:52868.96
Organism:Homo sapiens (Human)
Description:P21554
Residue:472
BDBM50426121
NameBDBM50426121
Synonyms:CHEMBL2316262
TypeSmall organic molecule
Emp. Form.C27H33N5O2
Mol. Mass.459.5832
SMILESCCCCCn1cc(C(=O)NC23CC4CC(CC(C4)C2)C3)c(=O)n2nc(nc12)-c1ccccc1